{"text_format":"1","workbook":"xlsx","n_sheets":9,"sheets":["CoverSheet","Instructions","Framework","Assessment Definitions","Survey","Scoring Detail","Scoring Summary","SlidebarMetrics","Set Parameters"],"not_rendered":{"charts":0,"images":5,"macros":1,"external_links":2,"defined_names":44,"comments":0,"pivot_tables":0},"unopened":[],"bounds":{"document_bytes":16777216,"sheet_cells":100000,"rows_first":2000,"rows_last":500,"rows_between":2000,"halvings":0,"cell_chars":16384,"cell_head_chars":4096},"cells_cut":0,"cells_raw":0,"read":"whole","date_system":"1900"}

{"sheet":"CoverSheet","index":0,"n_rows":0,"n_cols":0,"rows_kept":0,"cut":false,"hidden":false,"merged":[]}

{"sheet":"Instructions","index":1,"n_rows":15,"n_cols":5,"rows_kept":15,"cut":false,"hidden":false,"merged":[[14,1,14,14],[0,4,0,20],[2,1,2,15],[4,1,4,15],[6,1,6,14],[8,1,8,14],[10,1,10,14],[12,1,12,14]]}
[null,null,null,null,"Cloud Questionnaire Maturity Assessment Instructions"]
[]
[null,"The survey you are about to take will be used to measure your organization’s Cloud Maturity readiness against a maturity model and scan potential opportunities to leverage Cloud capabilities.  The survey is organized around multiple dimensions – each includes a set of key attributes which define the practices and competencies in place within your organization today."]
[]
[null,"For each of these attributes, you will also be asked to define where you want your organization to be in the future.  Note that the most important characteristics are highlighted. The survey takes roughly 60 minutes to complete and our consultants are available to review the results with you.  All results are kept anonymous and used only for overall benchmarking purposes. On the Survey Tab for each question, please enter in the digit 1 to 5 that corresponds to your maturity level. "]
[]
[null,"Instructions"]
[]
[null,"We appreciate your time and input in providing data on your organization's Cloud Maturity."]
[]
[null,"If some of the features in this sheet do not work, please ensure that your MACROS ARE ENABLED. "]
[]
[]
[]
[null,"If you do not have the most current version of excel, the sliders/graphics may not work.  If this is the case, you will need to manually enter the data in the spaces provided on the Survey tab."]
{"$rows_left_out":1}
{"sheet":"Framework","index":2,"n_rows":1,"n_cols":3,"rows_kept":1,"cut":false,"hidden":false,"merged":[[0,2,0,5]]}
[null,null,"Cloud Questionnaire Maturity Assessment Framework"]

{"sheet":"Assessment Definitions","index":3,"n_rows":24,"n_cols":3,"rows_kept":24,"cut":false,"hidden":false,"merged":[[0,2,0,5]]}
[null,null,"Cloud Questionnaire Maturity Assessment Definitions"]
[]
[null,"Terms","Definitions"]
[null,"Operational","Assessment of operational readiness (both in IT and the business) to support, manage, and operate cloud services"]
[null,"Regulatory","Assessment of regulatory, security, risk, and compliance for cloud services"]
[null,"Business Alignment","Assessment of business alignment to utilize cloud services based on business requirements, usability, and value"]
[null,"Technology","Assessment of the current technology estate (infrastructure, applications, architecture, etc.) for utilizing cloud services"]
[null,"SaaS (Software as a Service)","Business operations over a network (internet based)"]
[null,"Business and Technology Operations","Key primary activities of the organization to deliver the value expected under the strategy."]
[null,"People","Organizational structures, systems, and ways of working that should achieve the best equitable performance possible from its people."]
[null,"Process","This dimension tracks the maturity of processes; alignment to policies, frameworks, definition of roles and competencies, and structures; and integration with other IT and business stakeholders."]
[null,"Technology","This dimension assesses the effectiveness and usage of services, applications, infrastructure, data, and architecture supporting the business."]
[null,"Data","This dimension evaluates the mechanisms that support making intelligent, quantitatively-based decisions.  It assesses report mapping to process and KPI's and physical data architecture."]
[null,"Risk and Controls","This dimension assesses the management of fraud, financial, regulatory, and technical risks and compliance issues by analyzing business control structures, risk hierarchy, and financial statement items."]
[null,"IaaS (Infrastructure as a Service)","Rent storage, processing, network, and other computing resources"]
{"$rows_left_out":10}
{"sheet":"Survey","index":4,"n_rows":81,"n_cols":19,"rows_kept":81,"cut":false,"hidden":false,"merged":[[26,1,26,2],[46,1,46,2],[60,1,60,2],[0,1,0,18]]}
[null,"Cloud Maturity Assessment"]
[]
[null,"Maturity Question",null,null,"Level 1",null,"Level 2",null,"Level 3",null,"Level 4",null,"Level 5",null,"Current",null,"Future",null,"Comments"]
[]
[1,"Operational (10)","Category","Framework"]
[]
[null,"A service management organization is implemented across the IT function looking at the IT service components and end-to-end delivery model, reporting capacity, usage metrics and user experience accordingly","IT Service Management","ITIL","The is no service management capability within the IT function",null,"Capability exists, but is inconsistent and distributed across the IT function as part of the job description of managers overseeing particular IT services (e.g. network managers and admins look after the vendor relationships).",null,"A service management organization is implemented across the IT function looking at the component level of an IT service and managing and reporting capacity and usage metrics accordingly.",null,"A service management organization is implemented across the IT function looking at the IT service components and end-to-end delivery model, reporting capacity, usage metrics and user experience accordingly.",null,"The service management organization has implemented processes for monitoring IT services at the component and end-to-end delivery model. Cloud service provider performance is monitored in the context of user experience, adherence to service levels, 'real time' capacity and usage metrics. This is done to inform the vendor management team so that decisions around ongoing 'right-fit' vendors for the business can be made on a rolling basis.",null,1,null,{"$f":"MIN(O7+1,5)","v":2}]
[]
[null,"IT services are charged back to the business based on the cloud principles of 'on demand' and 'pay per use'.  The business units would be billed regularly on a usage basis, which would provide transparency over the value of IT services provided.","IT Financial Management","ITIL / TBM","IT is a single cost center across the business.",null,"Charge back is implemented at a project level for commissioning only and not ongoing usage.",null,"Charge back for IT services is based on a per capital basis: the number of users in the business is directly proportional to the charge.",null,"Charge back to business units for ongoing usage is limited to shared core infrastructure services (e.g. fixed line and mobile telephony).",null,"IT services are charged back to the business based on the cloud principles of 'on demand' and 'pay per use'. The business units would be billed regularly on a usage basis which provides transparency for the value of IT services provided.",null,1,null,{"$f":"MIN(O9+1,5)","v":2}]
[]
[null,"A test management function is in place to provide business and technical assurance on the migration to cloud services. This function has a focus on consistency of performance and service availability.  Also, a testing regime is in place to provide ongoing assurance after the completion of the migration,\ndue to the agile nature of the cloud.","Release Management","ITIL","There is no test management function in place to provide business and technical assurance.",null,"Testing is performed on a per project basis and ad hoc in its organization, resourcing and planning.",null,"A test management function is in place with common practices embedded into new projects.",null,"A test management function is in place with a library of business and technology test scripts to support specific business change programs. This includes the cloud but is limited to implementation and migration of services.",null,"A test management function is in place to provide business and technical assurance over the migration to cloud services with a focus on consistency of performance and service availability. On completion of migration, due to the agile nature of cloud, an ongoing testing regime is in place to provide ongoing assurance.",null,1,null,{"$f":"MIN(O11+1,5)","v":2}]
[]
[null,"A 'real-time' software management system is implemented through an integrated platform between the IT function and CSPs.  The platform supports the implementation of business rules by the IT function as well as usage thresholds and 'real-time' alerting limits to provide timely interventions. Furthermore, it supports constraints for usage across different platforms and geographies by the CSP.","Software Asset Management","COBIT","There is no defined governance model or process in place to manage software compliance.",null,"Software compliance processes are not defined and are typically reactive in response to a vendor audit.",null,"There is a defined governance model or process in place for the management of software compliance. However, this is  constrained to in-house run IT services and does not cover third party vendors.",null,"There is a defined governance model and process in place for the management of software compliance across the IT ecosystem of vendors. Reporting is retrospective of usage.",null,"A 'real-time' software management system is implemented through an integrated platform between the IT function and CSPs. The platform supports the implementation of business rules by the IT function as well as usage thresholds and 'real-time' alerting limits. Furthermore, it supports constraints for usage across different platforms and geographies by the CSP.",null,1,null,{"$f":"MIN(O13+1,5)","v":2}]
[]
[null,"An incident monitoring and alerting process as well as a supporting technology platform are implemented to aggregate incidents across the CSP ecosystem. These incidents are used to provide a management dashboard view of security and operational impacts on the business' IT services. The dashboard also contains insights into root cause analysis for event coordination and management.","Service Operations","ITIL","There is no defined process in place for managing incidents. Response to incidents tends to be reactive.",null,"There is a defined incident management process implemented that focuses on IT component level monitoring, alerting and resolution. It does not take a service orientated view.",null,"There is a defined incident management process implemented that has a service orientated view within the IT function and does not coordinate with third party service providers.",null,"There is a central point that monitors disparate feeds from the IT service supply chain (internal and cloud) on all high priority incidents. This central point is used for coordination, management and resolution.",null,"An incident monitoring and alerting process as well as a supporting technology platform are implemented to aggregate incidents across the CSP ecosystem. These incidents are used to provide a management dashboard view of security and operational impacts on the business' IT services. The dashboard also contains insights into root cause analysis for event coordination and management.",null,1,null,{"$f":"MIN(O15+1,5)","v":2}]
{"$rows_left_out":67}
{"sheet":"Scoring Detail","index":5,"n_rows":39,"n_cols":11,"rows_kept":39,"cut":false,"hidden":false,"merged":[[2,1,3,1],[2,2,3,2],[0,4,0,17],[2,7,2,10]]}
[]
[]
[null,"Capability","Maturity Question",null,"Assessed","Target",null,"Dimension"]
[null,null,null,null,null,null,null,"People","Process","Technology","Data"]
[1,{"$f":"Survey!B5","v":"Operational (10)"},1,{"$f":"INDEX(Survey!$B$5:$B$200,MATCH(B$5,Survey!$B$5:$B$200,0)+2*C5,0)","v":"A service management organization is implemented across the IT function looking at the IT service components and end-to-end delivery model, reporting capacity, usage metrics and user experience accordingly"},{"$f":"INDEX(Survey!$B$5:$R$200,MATCH(B$5,Survey!$B$5:$B$200,0)+2*C5,14)","v":1},{"$f":"INDEX(Survey!$B$5:$R$200,MATCH(B$5,Survey!$B$5:$B$200,0)+2*C5,16)","v":2},null,{"$f":"MATCH(B5,Survey!$B$5:$B$200,0)+2*C5","v":3}]
[null,null,{"$f":"C5+1","v":2},{"$f":"INDEX(Survey!$B$5:$B$200,MATCH(B$5,Survey!$B$5:$B$200,0)+2*C6,0)","v":"IT services are charged back to the business based on the cloud principles of 'on demand' and 'pay per use'.  The business units would be billed regularly on a usage basis, which would provide transparency over the value of IT services provided."},{"$f":"INDEX(Survey!$B$5:$R$200,MATCH(B$5,Survey!$B$5:$B$200,0)+2*C6,14)","v":1},{"$f":"INDEX(Survey!$B$5:$R$200,MATCH(B$5,Survey!$B$5:$B$200,0)+2*C6,16)","v":2}]
[null,null,{"$f":"C6+1","v":3},{"$f":"INDEX(Survey!$B$5:$B$200,MATCH(B$5,Survey!$B$5:$B$200,0)+2*C7,0)","v":"A test management function is in place to provide business and technical assurance on the migration to cloud services. This function has a focus on consistency of performance and service availability.  Also, a testing regime is in place to provide ongoing assurance after the completion of the migration,\ndue to the agile nature of the cloud."},{"$f":"INDEX(Survey!$B$5:$R$200,MATCH(B$5,Survey!$B$5:$B$200,0)+2*C7,14)","v":1},{"$f":"INDEX(Survey!$B$5:$R$200,MATCH(B$5,Survey!$B$5:$B$200,0)+2*C7,16)","v":2}]
[null,null,4,{"$f":"INDEX(Survey!$B$5:$B$200,MATCH(B$5,Survey!$B$5:$B$200,0)+2*C8,0)","v":"A 'real-time' software management system is implemented through an integrated platform between the IT function and CSPs.  The platform supports the implementation of business rules by the IT function as well as usage thresholds and 'real-time' alerting limits to provide timely interventions. Furthermore, it supports constraints for usage across different platforms and geographies by the CSP."},{"$f":"INDEX(Survey!$B$5:$R$200,MATCH(B$5,Survey!$B$5:$B$200,0)+2*C8,14)","v":1},{"$f":"INDEX(Survey!$B$5:$R$200,MATCH(B$5,Survey!$B$5:$B$200,0)+2*C8,16)","v":2}]
[null,null,5,{"$f":"INDEX(Survey!$B$5:$B$200,MATCH(B$5,Survey!$B$5:$B$200,0)+2*C9,0)","v":"An incident monitoring and alerting process as well as a supporting technology platform are implemented to aggregate incidents across the CSP ecosystem. These incidents are used to provide a management dashboard view of security and operational impacts on the business' IT services. The dashboard also contains insights into root cause analysis for event coordination and management."},{"$f":"INDEX(Survey!$B$5:$R$200,MATCH(B$5,Survey!$B$5:$B$200,0)+2*C9,14)","v":1},{"$f":"INDEX(Survey!$B$5:$R$200,MATCH(B$5,Survey!$B$5:$B$200,0)+2*C9,16)","v":2}]
[null,null,6,{"$f":"INDEX(Survey!$B$5:$B$200,MATCH(B$5,Survey!$B$5:$B$200,0)+2*C10,0)","v":"A service integration layer is deployed that manages user access to disparate cloud solutions. Self-service registration and single sign-on technologies  are leveraged to access the cloud in a consistent manner which will reduce complexity.  Most of the commoditized activities of the helpdesk function have moved to a cloud service, with associated internal efficiencies in terms of headcount and operations."},{"$f":"INDEX(Survey!$B$5:$R$200,MATCH(B$5,Survey!$B$5:$B$200,0)+2*C10,14)","v":1},{"$f":"INDEX(Survey!$B$5:$R$200,MATCH(B$5,Survey!$B$5:$B$200,0)+2*C10,16)","v":2}]
[null,null,7,{"$f":"INDEX(Survey!$B$5:$B$200,MATCH(B$5,Survey!$B$5:$B$200,0)+2*C11,0)","v":"The organization has a strong capability to implement change across all areas of the business, including people, processes and tools. A mature Change Management Office is capable to driving change as part of the project process, and strong alignment between the business and IT organization ensures that any change required delivers strong results."},{"$f":"INDEX(Survey!$B$5:$R$200,MATCH(B$5,Survey!$B$5:$B$200,0)+2*C11,14)","v":1},{"$f":"INDEX(Survey!$B$5:$R$200,MATCH(B$5,Survey!$B$5:$B$200,0)+2*C11,16)","v":2}]
[null,null,8,{"$f":"INDEX(Survey!$B$5:$B$200,MATCH(B$5,Survey!$B$5:$B$200,0)+2*C12,0)","v":"The organization views IT as a commodity resource to be integrated into wider business operations. The retained internal IT organization provides oversight and direction for IT suppliers, who provide IT service outcomes to the business as opposed to specific infrastructure or applications."},{"$f":"INDEX(Survey!$B$5:$R$200,MATCH(B$5,Survey!$B$5:$B$200,0)+2*C12,14)","v":1},{"$f":"INDEX(Survey!$B$5:$R$200,MATCH(B$5,Survey!$B$5:$B$200,0)+2*C12,16)","v":2}]
[null,null,9,{"$f":"INDEX(Survey!$B$5:$B$200,MATCH(B$5,Survey!$B$5:$B$200,0)+2*C13,0)","v":"Asset and configuration management processes deliver deep knowledge and insight into the use of IT assets by the business. Clear linkages can be made through the application stack from End Users through to physical infrastructure."},{"$f":"INDEX(Survey!$B$5:$R$200,MATCH(B$5,Survey!$B$5:$B$200,0)+2*C13,14)","v":1},{"$f":"INDEX(Survey!$B$5:$R$200,MATCH(B$5,Survey!$B$5:$B$200,0)+2*C13,16)","v":2}]
[null,null,10,{"$f":"INDEX(Survey!$B$5:$B$200,MATCH(B$5,Survey!$B$5:$B$200,0)+2*C14,0)","v":"The organization is able to support multiple suppliers for all IT services, covering all aspects of process and vendor management. New suppliers can be on boarded into the IT environment with ease due to adoption of open standards, and the architecture for the environment allows compute capacity to be migrated quickly between suppliers."},{"$f":"INDEX(Survey!$B$5:$R$200,MATCH(B$5,Survey!$B$5:$B$200,0)+2*C14,14)","v":1},{"$f":"INDEX(Survey!$B$5:$R$200,MATCH(B$5,Survey!$B$5:$B$200,0)+2*C14,16)","v":2}]
[2,{"$f":"Survey!B27","v":"Regulatory (9)"},1,{"$f":"INDEX(Survey!$B$5:$B$200,MATCH(B$15,Survey!$B$5:$B$200,0)+2*C5,0)","v":"Current policies for information security risks deal with cloud characteristics  e.g. multi-tenanted environments."},{"$f":"INDEX(Survey!$B$5:$R$200,MATCH(B$15,Survey!$B$5:$B$200,0)+2*C15,14)","v":2},{"$f":"INDEX(Survey!$B$5:$R$200,MATCH(B$15,Survey!$B$5:$B$200,0)+2*C15,16)","v":3}]
{"$rows_left_out":25}
{"sheet":"Scoring Summary","index":6,"n_rows":7,"n_cols":9,"rows_kept":7,"cut":false,"hidden":false,"merged":[[0,1,0,4]]}
[null,"Cloud Maturity Assessment Survey Scorecard"]
[]
[null,"Capability Category","Assess","Target"]
[1,{"$f":"TRIM(LEFT(I4,LEN(I4)-4))","v":"Operational"},{"$f":"getScoreAssess(A4)","v":1},{"$f":"getTargetAssess(A4)","v":2},null,null,null,null,{"$f":"VLOOKUP(A4,'Scoring Detail'!$A$1:$B$49,2,FALSE)","v":"Operational (10)"}]
[2,{"$f":"TRIM(LEFT(I5,LEN(I5)-4))","v":"Regulatory"},{"$f":"getScoreAssess(A5)","v":2},{"$f":"getTargetAssess(A5)","v":3},null,null,null,null,{"$f":"VLOOKUP(A5,'Scoring Detail'!$A$1:$B$49,2,FALSE)","v":"Regulatory (9)"}]
[3,"Business Alignment",3,4,null,null,null,null,{"$f":"VLOOKUP(A6,'Scoring Detail'!$A$1:$B$49,2,FALSE)","v":"Business Alignment (6)"}]
[4,"Technology",4,5,null,null,null,null,{"$f":"VLOOKUP(A7,'Scoring Detail'!$A$1:$B$49,2,FALSE)","v":"Technology (10)"}]

{"sheet":"SlidebarMetrics","index":7,"n_rows":7,"n_cols":6,"rows_kept":7,"cut":false,"hidden":false,"merged":[]}
[null,null,null,null,null,"Average Overall  Score"]
[null,{"$f":"ROUND(SUMPRODUCT(B4:B7,D4:D7)/SUM(D3:D7),1)","v":2.5},{"$f":"ROUND(SUMPRODUCT(C4:C7,D4:D7)/SUM(D3:D7),1)","v":3.5}]
["graphNum","rawAssScore","rawTrgScore","weight","Capability Category","Category Score"]
[1,{"$f":"'Scoring Summary'!C4","v":1},{"$f":"'Scoring Summary'!D4","v":2},1,{"$f":"'Scoring Summary'!B4","v":"Operational"}]
[{"$f":"A4+1","v":2},{"$f":"'Scoring Summary'!C5","v":2},{"$f":"'Scoring Summary'!D5","v":3},1,{"$f":"'Scoring Summary'!B5","v":"Regulatory"}]
[{"$f":"A5+1","v":3},{"$f":"'Scoring Summary'!C6","v":3},{"$f":"'Scoring Summary'!D6","v":4},1,{"$f":"'Scoring Summary'!B6","v":"Business Alignment"}]
[4,{"$f":"'Scoring Summary'!C7","v":4},{"$f":"'Scoring Summary'!D7","v":5},1,{"$f":"'Scoring Summary'!B7","v":"Technology"}]

{"sheet":"Set Parameters","index":8,"n_rows":13,"n_cols":5,"rows_kept":13,"cut":false,"hidden":false,"merged":[]}
["Set Parameters"]
[]
["SourceGraph"]
[]
[]
[null,null,null,"Low","High"]
["TargetSheet","SlidebarMetrics",null,{"$f":"ROUND(E7-0.8,1)","v":1},{"$f":"D8-0.001","v":1.7990000000000002}]
["NumberSlideGraphs",4,null,{"$f":"ROUND(E8-0.8,1)","v":1.8},{"$f":"D9-0.001","v":2.5990000000000002}]
[null,null,null,2.6,3.399]
["StartGraph","F4",null,3.4,4.1989999999999998]
["TotalScoreLocation","F2",null,{"$f":"E11-0.8","v":4.2},5]
[]
["DebugCell","H2"]