{"text_format":"1","workbook":"xlsx","n_sheets":11,"sheets":["CoverSheet","Assessment Definitions","Instructions","Framework","Survey","Scoring Detail","Scoring Summary","SlidebarMetrics","Set Parameters","Instructions (2)","Debug"],"not_rendered":{"charts":0,"images":5,"macros":1,"external_links":0,"defined_names":12,"comments":0,"pivot_tables":0},"unopened":[],"bounds":{"document_bytes":16777216,"sheet_cells":100000,"rows_first":2000,"rows_last":500,"rows_between":2000,"halvings":0,"cell_chars":16384,"cell_head_chars":4096},"cells_cut":0,"cells_raw":0,"read":"whole","date_system":"1900"}

{"sheet":"CoverSheet","index":0,"n_rows":0,"n_cols":0,"rows_kept":0,"cut":false,"hidden":false,"merged":[]}

{"sheet":"Assessment Definitions","index":1,"n_rows":24,"n_cols":3,"rows_kept":24,"cut":false,"hidden":false,"merged":[[0,2,0,18]]}
[null,null,"Data Management & Data Analytics Assessment Survey Definitions"]
[]
[null,"Terms","Definitions"]
[null,"Business rules","A business rule is an agreement driven from the business process which applies to the fields in a master data object. These business rules are linked to fields in a master data object in the data rule book"]
[null,"Data Architecture","This section evaluates the maturity of the <business unit> Data Governance Data Quality Strategy and Program capabilities as they relate to best practices in Data Governance.  Data Architecture, for this context, defines the technical requirements and architectural framework associated with integrating data into the business processes and downstream systems of the <business unit> organization for data governance."]
[null,"Data Management Methodology","This section evaluates the maturity of the <business unit> Data Governance Data Management Methodology capabilities as they relate to best practices in Data Governance. The Data Management Methodology, for this context, is the systematic and theoretical analysis of how data is managed, organized, linked, and funded within the <business unit> data governance program and embedded into the operational philosophy of the organization. "]
[null,"Data Monitoring and Reporting","This section evaluates the maturity of the <business unit> Data Governance Data Monitoring and Reporting capabilities as they relate to best practices in Data Governance. Data Monitoring and Reporting, for this context, are the <business unit> capabilities to review, evaluate, and modify the addition, deletion, modification and use of governed data.  It enables the governance administration activities to review the overall governance processes and functions performed on the data graphically or through pre-defined reports."]
[null,"Data Quality Management Operations and Support","This section evaluates the maturity of the <business unit> Data Governance Data Quality Management Operations and Support capabilities as they relate to best practices in Data Governance.  Data Quality Management Operations and Support, for this context, refers to the actionable capabilities of the <business unit> data governance program to maintain and ensure the completeness, coverage, conformity, consistency, accuracy, non-duplication and timeliness of data across the organization."]
[null,"Data Quality Strategy and Program","This section evaluates the maturity of the <business unit> Data Governance Data Quality Strategy and Program capabilities as they relate to best practices in Data Governance.  The Data Quality Strategy for this context, pertains to the <business unit> data quality plan or method defining the processes and approaches used to ensure the completeness, coverage, conformity, consistency, accuracy, non-duplication and timeliness of data across the organization."]
[null,"Data Security and Privacy","This section evaluates the maturity of the <business unit> Data Governance Data Security and Privacy capabilities as they relate to best practices in Data Governance. Data Security and Privacy, for this context, refers to protective digital privacy measures applied data, to prevent destructive forces and access to computers, databases, and websites from unauthorized users within the <business unit> data governance environment."]
[null,"Data Standard","Data Standards are documented agreements on representations, formats, and definitions of data. These can be external standards or internally from the company."]
[null,"Data Strategy and Roadmap","This section evaluates the maturity of the <business unit> Data Governance Data Strategy and Roadmap capabilities as they relate to best practices in Data Governance.  The Data Strategy concept, for this context, is a standard definition and describes a documented and approved conceptual approach that  defines an ability of a the <business unit> organization to precisely define and effectively retrieve accurate, consistent and transparent data content for both internal applications and processes and external communication.  Eventually the strategy comes to represent a family of strategies, whose implementation can be scheduled via a series of projects, or a Roadmap. "]
[null,"Derived Data","Data that is the result of a computational step applied to reference of event data. Derived data is the result of either of relating two or more elements of a single transaction (such as an aggregation) or of relating one or more elements of a transaction to an external algorithm or rule\n"]
[null,"KDE","Key Data Elements are data elements of highest important to the agency/department"]
[null,"Master Data","Data that describes the people, places, and things that are involved in an organization’s business. It is the information required to create and maintain an enterprise-wide “system of record” for core business entities in order to capture business transactions and measure results for these entities\n"]
{"$rows_left_out":10}
{"sheet":"Instructions","index":2,"n_rows":15,"n_cols":5,"rows_kept":15,"cut":false,"hidden":false,"merged":[[14,1,14,14],[0,4,0,20],[2,1,2,15],[4,1,4,15],[6,1,6,14],[8,1,8,14],[10,1,10,14],[12,1,12,14]]}
[null,null,null,null,"Data Management & Data Analytics Assessment Survey Instructions"]
[]
[null,"The survey you are about to take will be used to measure your organization’s Data Management and Analytics readiness against a maturity model.and scan potential opportunities to leverage Data Management and Analytics capabilities. The survey is organized around multiple dimensions  – each includes a set of key attributes which define the practices and competencies in place within your organization today."]
[]
[null,"For each of these attributes, you will also be asked to define where you want your organization to be in the future.  Note that the most important characteristics are highlighted. The survey takes roughly 60 minutes to complete and our consultants are available to review the results with you.  All results are kept anonymous and used only for overall benchmarking purposes. On the Survey Tab for each question, please enter in the digit 1 to 5 that corresponds to your maturity level. "]
[]
[null,"Instructions"]
[]
[null,"KPMG appreciates your time and input in regards to providing data on your organization's Data Management and Analytic Capabilities"]
[]
[null,"If some of the features in this sheet do not work, please ensure that your MACROS ARE ENABLED.  "]
[]
[]
[]
[null,"If you do not have the most current version of excel, the sliders/graphics may not work.  If this is the case, you will need to manually enter the data in the spaces provided on the Survey tab."]
{"$rows_left_out":1}
{"sheet":"Framework","index":3,"n_rows":1,"n_cols":3,"rows_kept":1,"cut":false,"hidden":false,"merged":[[0,2,0,5]]}
[null,null,"Data Management & Data Analytics Assessment Survey Framework"]

{"sheet":"Survey","index":4,"n_rows":113,"n_cols":19,"rows_kept":113,"cut":false,"hidden":false,"merged":[[98,1,98,2],[14,1,14,2],[0,3,0,18],[86,1,86,2],[46,1,46,2],[66,1,66,2],[56,1,56,2],[76,1,76,2],[24,1,24,2],[36,1,36,2],[4,1,4,2]]}
[null,null,null,"Data Management & Data Analytics  Assessment"]
[]
[null,"Maturity Question",null,null,"Level 1",null,"Level 2",null,"Level 3",null,"Level 4",null,"Level 5",null,"Assessed",null,"Goal",null,"Comments"]
[]
[1,"Data Governance and Standardization (4)"]
[]
[1,"Has a data governance structure been established with dedicated resources to oversee the data environment effectively resolve any potential governance issues ?",null,null,"Little or no awareness of need for data governance/ownership.  No clear organization structure is in place. \nAbsence of data ownership at any level of the organization. ",null,"Multiple master data owners, who manage but aren't responsible for critical data objects across agency systems. No coordination within the broader business unit.\n",null,"Top management concerned about data management practices. Defined roles, responsibilities and areas of accountability for all impacted parties within the governance organization exist for maintaining communication and managing activities to govern business rules",null,"A clear agency wide hierarchical data governance model exists, responsibilities are communicated and endorsed by leadership, and processes in place to allow drill down from global level to function level. Central organization is held accountable to data quality standards set out at a strategic level.",null,"Agency wide data governance with data stewards and owners in place to administer the overall governance and activities needed to maintain efficient master data and insights shared across owners. Data governance organization evolves to address extra-organizational (state-wide) needs",null,1,null,{"$f":"O7+1","v":2}]
[null,null,{"$f":"Survey!B13","v":"Is the agency ready to institutionalize structures and processes to comply with data governance charter?"}]
[2,"Are data governance policies, procedures and standards in place and are they complied with? ",null,null,"No formal policies or procedures in place. Data issues resolution is reactive and undertaken by the broader IT group. ",null,"While still reactive, some data governance processes, policies and controls in place. High dependency on knowledge of a few individuals.",null,"Data governance processes & controls are in place. Data policies & standards are documented. Key capabilities in place to monitor & manage data but underutilized.",null,"Data is managed & monitored according to established policies, controls and standard, all with measurables KPIs. Data routines are largely automated and measured. Policies and procedures widely communicated with good uptake. ",null,"Data Governance treated as a core competency across strategy, people, process, technology, and control. Policies adopted across the organization and monitored.",null,1,null,{"$f":"O9+1","v":2}]
[]
[3,"Are there technology tools to assist in the automation of data governance processes?",null,null,"There are no automated tools that are used to support data governance",null,"Standalone and customized tools such as Excel and Access are used to support data governance processes. Tools are not well documented",null,"There is a centralized database with some custom application support within business units and user manuals exist. Limited number of users are trained in the tool set.",null,"A well defined, well documented data governance tool set exists to support managing and monitoring data governance processes. Users are trained in the tool set.",null,"The toolset is continuously updated to incorporate lessons learned and evolving leading practices. Toolset training is mandatory.",null,1,null,{"$f":"O11+1","v":2}]
[]
[4,"Is the agency ready to institutionalize structures and processes to comply with data governance charter?",null,null,"No processes are in place to signal new requirements and change processes to ensure compliance.",null,"Some business units have standardized processes in place but compliance is ad hoc.",null,"Responsibility is assigned to a single unit for incorporation of new legislation and regulatory requirements, and it is making some progress but has not implemented consistent processes.",null,"The organization is pro-actively monitoring potential changes in legislation and regulatory requirements and anticipating the impact on analytics activities",null,"The organization is involved in discussion with its stakeholders, government and regulators to contribute to the discussion on new legislation and regulatory requirements, i.e. a thought leader in the field",null,1,null,{"$f":"O13+1","v":2}]
[]
[2,"Data Strategy and Roadmap (4)"]
{"$rows_left_out":99}
{"sheet":"Scoring Detail","index":5,"n_rows":49,"n_cols":11,"rows_kept":49,"cut":false,"hidden":false,"merged":[[2,1,3,1],[2,2,3,2],[0,4,0,17],[2,7,2,10]]}
[]
[]
[null,"Capability","Maturity Question",null,"Assessed","Target",null,"Dimension"]
[null,null,null,null,null,null,null,"People","Process","Technology","Data"]
[1,{"$f":"Survey!B5","v":"Data Governance and Standardization (4)"},1,{"$f":"INDEX(Survey!$B$5:$B$200,MATCH(B$5,Survey!$B$5:$B$200,0)+2*C5,0)","v":"Has a data governance structure been established with dedicated resources to oversee the data environment effectively resolve any potential governance issues ?"},{"$f":"INDEX(Survey!$B$5:$R$200,MATCH(B$5,Survey!$B$5:$B$200,0)+2*C5,14)","v":1},{"$f":"INDEX(Survey!$B$5:$R$200,MATCH(B$5,Survey!$B$5:$B$200,0)+2*C5,16)","v":2},null,{"$f":"MATCH(B5,Survey!$B$5:$B$200,0)+2*C5","v":3}]
[null,null,2,{"$f":"INDEX(Survey!$B$5:$B$200,MATCH(B$5,Survey!$B$5:$B$200,0)+2*C6,0)","v":"Are data governance policies, procedures and standards in place and are they complied with? "},{"$f":"INDEX(Survey!$B$5:$R$200,MATCH(B$5,Survey!$B$5:$B$200,0)+2*C6,14)","v":1},{"$f":"INDEX(Survey!$B$5:$R$200,MATCH(B$5,Survey!$B$5:$B$200,0)+2*C6,16)","v":2}]
[null,null,3,{"$f":"INDEX(Survey!$B$5:$B$200,MATCH(B$5,Survey!$B$5:$B$200,0)+2*C7,0)","v":"Are there technology tools to assist in the automation of data governance processes?"},{"$f":"INDEX(Survey!$B$5:$R$200,MATCH(B$5,Survey!$B$5:$B$200,0)+2*C7,14)","v":1},{"$f":"INDEX(Survey!$B$5:$R$200,MATCH(B$5,Survey!$B$5:$B$200,0)+2*C7,16)","v":2}]
[null,null,4,{"$f":"INDEX(Survey!$B$5:$B$200,MATCH(B$5,Survey!$B$5:$B$200,0)+2*C8,0)","v":"Is the agency ready to institutionalize structures and processes to comply with data governance charter?"},{"$f":"INDEX(Survey!$B$5:$R$200,MATCH(B$5,Survey!$B$5:$B$200,0)+2*C8,14)","v":1},{"$f":"INDEX(Survey!$B$5:$R$200,MATCH(B$5,Survey!$B$5:$B$200,0)+2*C8,16)","v":2}]
[2,{"$f":"Survey!B15","v":"Data Strategy and Roadmap (4)"},1,{"$f":"INDEX(Survey!$B$5:$B$200,MATCH(B$9,Survey!$B$5:$B$200,0)+2*C9,0)","v":"Is data valued as an asset?"},{"$f":"INDEX(Survey!$B$5:$R$200,MATCH(B$9,Survey!$B$5:$B$200,0)+2*C9,14)","v":1},{"$f":"INDEX(Survey!$B$5:$R$200,MATCH(B$9,Survey!$B$5:$B$200,0)+2*C9,16)","v":2}]
[null,null,2,{"$f":"INDEX(Survey!$B$5:$B$200,MATCH(B$9,Survey!$B$5:$B$200,0)+2*C10,0)","v":"Do you have a dedicated experienced team in place to understand, design, and execute a data strategy and roadmap?"},{"$f":"INDEX(Survey!$B$5:$R$200,MATCH(B$9,Survey!$B$5:$B$200,0)+2*C10,14)","v":2},{"$f":"INDEX(Survey!$B$5:$R$200,MATCH(B$9,Survey!$B$5:$B$200,0)+2*C10,16)","v":3}]
[null,null,3,{"$f":"INDEX(Survey!$B$5:$B$200,MATCH(B$9,Survey!$B$5:$B$200,0)+2*C11,0)","v":"Are processes in place to develop a data strategy and execute against the strategy?"},{"$f":"INDEX(Survey!$B$5:$R$200,MATCH(B$9,Survey!$B$5:$B$200,0)+2*C11,14)","v":3},{"$f":"INDEX(Survey!$B$5:$R$200,MATCH(B$9,Survey!$B$5:$B$200,0)+2*C11,16)","v":4}]
[null,null,4,{"$f":"INDEX(Survey!$B$5:$B$200,MATCH(B$9,Survey!$B$5:$B$200,0)+2*C12,0)","v":"Is there technology to support the development of the data strategy and roadmap"},{"$f":"INDEX(Survey!$B$5:$R$200,MATCH(B$9,Survey!$B$5:$B$200,0)+2*C12,14)","v":4},{"$f":"INDEX(Survey!$B$5:$R$200,MATCH(B$9,Survey!$B$5:$B$200,0)+2*C12,16)","v":5}]
[3,{"$f":"Survey!B25","v":"Data Architecture (5)"},1,{"$f":"INDEX(Survey!$B$5:$B$200,MATCH(B$13,Survey!$B$5:$B$200,0)+2*C13,0)","v":"Is there an organization responsible for the data architecture in the organization?"},{"$f":"INDEX(Survey!$B$5:$R$200,MATCH(B$13,Survey!$B$5:$B$200,0)+2*C13,14)","v":1},{"$f":"INDEX(Survey!$B$5:$R$200,MATCH(B$13,Survey!$B$5:$B$200,0)+2*C13,16)","v":2}]
[null,null,2,{"$f":"INDEX(Survey!$B$5:$B$200,MATCH(B$13,Survey!$B$5:$B$200,0)+2*C14,0)","v":"Is there a consistent toolset available and used across the organization?"},{"$f":"INDEX(Survey!$B$5:$R$200,MATCH(B$13,Survey!$B$5:$B$200,0)+2*C14,14)","v":2},{"$f":"INDEX(Survey!$B$5:$R$200,MATCH(B$13,Survey!$B$5:$B$200,0)+2*C14,16)","v":3}]
[null,null,3,{"$f":"INDEX(Survey!$B$5:$B$200,MATCH(B$13,Survey!$B$5:$B$200,0)+2*C15,0)","v":"Does technology support the business requirements?"},{"$f":"INDEX(Survey!$B$5:$R$200,MATCH(B$13,Survey!$B$5:$B$200,0)+2*C15,14)","v":3},{"$f":"INDEX(Survey!$B$5:$R$200,MATCH(B$13,Survey!$B$5:$B$200,0)+2*C15,16)","v":4}]
{"$rows_left_out":35}
{"sheet":"Scoring Summary","index":6,"n_rows":13,"n_cols":9,"rows_kept":13,"cut":false,"hidden":false,"merged":[[0,1,0,4]]}
[null,"Data Management & Data Analytics Assessment Survey Scorecard"]
[]
[null,"Capability Category","Assess","Target"]
[1,{"$f":"TRIM(LEFT(I4,LEN(I4)-3))","v":"Data Governance and Standardization"},{"$f":"getScoreAssess(A4)","v":1},{"$f":"getTargetAssess(A4)","v":2},null,null,null,null,{"$f":"VLOOKUP(A4,'Scoring Detail'!$A$1:$B$49,2,FALSE)","v":"Data Governance and Standardization (4)"}]
[2,{"$f":"TRIM(LEFT(I5,LEN(I5)-3))","v":"Data Strategy and Roadmap"},{"$f":"getScoreAssess(A5)","v":2.5},{"$f":"getTargetAssess(A5)","v":3.5},null,null,null,null,{"$f":"VLOOKUP(A5,'Scoring Detail'!$A$5:$B$49,2,FALSE)","v":"Data Strategy and Roadmap (4)"}]
[3,"Data Architecture",{"$f":"getScoreAssess(A6)","v":2.8},{"$f":"getTargetAssess(A6)","v":3.8},null,null,null,null,{"$f":"VLOOKUP(A6,'Scoring Detail'!$A$5:$B$49,2,FALSE)","v":"Data Architecture (5)"}]
[4,"Master Data Management (MDM)",4,5,null,null,null,null,{"$f":"VLOOKUP(A7,'Scoring Detail'!$A$5:$B$49,2,FALSE)","v":"Master Data Management (MDM) (4)"}]
[5,"MetaData Management",3,4,null,null,null,null,{"$f":"VLOOKUP(A8,'Scoring Detail'!$A$5:$B$49,2,FALSE)","v":"MetaData Management (4)"}]
[6,"Data Quality",2,3,null,null,null,null,{"$f":"VLOOKUP(A9,'Scoring Detail'!$A$5:$B$49,2,FALSE)","v":"Data Quality (4)"}]
[7,"Data Management Methodology",2.5,3.5,null,null,null,null,{"$f":"VLOOKUP(A10,'Scoring Detail'!$A$5:$B$49,2,FALSE)","v":"Data Management Methodology (4)"}]
[8,"Program Management and Change Control",2.5,3.5,null,null,null,null,{"$f":"VLOOKUP(A11,'Scoring Detail'!$A$5:$B$49,2,FALSE)","v":"Program Management and Change Control (4)"}]
[9,"Data Security and Privacy",3,3.8,null,null,null,null,{"$f":"VLOOKUP(A12,'Scoring Detail'!$A$5:$B$49,2,FALSE)","v":"Data Security and Privacy (5)"}]
[10,"Data Analytics (D&A)",3.1428571428571428,4,null,null,null,null,{"$f":"VLOOKUP(A13,'Scoring Detail'!$A$5:$B$49,2,FALSE)","v":"Data Analytics (D&A) (7)"}]

{"sheet":"SlidebarMetrics","index":7,"n_rows":13,"n_cols":6,"rows_kept":13,"cut":false,"hidden":false,"merged":[]}
[null,null,null,null,null,"Average Overall  Score"]
[null,{"$f":"ROUND(SUMPRODUCT(B4:B12,D4:D12)/SUM(D3:D12),1)","v":2.6},{"$f":"ROUND(SUMPRODUCT(C4:C12,D4:D12)/SUM(D3:D12),1)","v":3.6}]
["graphNum","rawAssScore","rawTrgScore","weight","Capability Category","Category Score"]
[1,{"$f":"'Scoring Summary'!C4","v":1},{"$f":"'Scoring Summary'!D4","v":2},1,{"$f":"'Scoring Summary'!B4","v":"Data Governance and Standardization"}]
[{"$f":"A4+1","v":2},{"$f":"'Scoring Summary'!C5","v":2.5},{"$f":"'Scoring Summary'!D5","v":3.5},1,{"$f":"'Scoring Summary'!B5","v":"Data Strategy and Roadmap"}]
[{"$f":"A5+1","v":3},{"$f":"'Scoring Summary'!C6","v":2.8},{"$f":"'Scoring Summary'!D6","v":3.8},1,{"$f":"'Scoring Summary'!B6","v":"Data Architecture"}]
[4,{"$f":"'Scoring Summary'!C7","v":4},{"$f":"'Scoring Summary'!D7","v":5},1,{"$f":"'Scoring Summary'!B7","v":"Master Data Management (MDM)"}]
[5,{"$f":"'Scoring Summary'!C8","v":3},{"$f":"'Scoring Summary'!D8","v":4},1,{"$f":"'Scoring Summary'!B8","v":"MetaData Management"}]
[6,{"$f":"'Scoring Summary'!C9","v":2},{"$f":"'Scoring Summary'!D9","v":3},1,{"$f":"'Scoring Summary'!B9","v":"Data Quality"}]
[7,{"$f":"'Scoring Summary'!C10","v":2.5},{"$f":"'Scoring Summary'!D10","v":3.5},1,{"$f":"'Scoring Summary'!B10","v":"Data Management Methodology"}]
[8,{"$f":"'Scoring Summary'!C11","v":2.5},{"$f":"'Scoring Summary'!D11","v":3.5},1,{"$f":"'Scoring Summary'!B11","v":"Program Management and Change Control"}]
[9,{"$f":"'Scoring Summary'!C12","v":3},{"$f":"'Scoring Summary'!D12","v":3.8},1,{"$f":"'Scoring Summary'!B12","v":"Data Security and Privacy"}]
[10,{"$f":"'Scoring Summary'!C13","v":3.1428571428571428},{"$f":"'Scoring Summary'!D13","v":4},1,{"$f":"'Scoring Summary'!B13","v":"Data Analytics (D&A)"}]

{"sheet":"Set Parameters","index":8,"n_rows":13,"n_cols":5,"rows_kept":13,"cut":false,"hidden":false,"merged":[]}
["Set Parameters"]
[]
["SourceGraph"]
[]
[]
[null,null,null,"Low","High"]
["TargetSheet","SlidebarMetrics",null,{"$f":"ROUND(E7-0.8,1)","v":1},{"$f":"D8-0.001","v":1.7990000000000002}]
["NumberSlideGraphs",10,null,{"$f":"ROUND(E8-0.8,1)","v":1.8},{"$f":"D9-0.001","v":2.5990000000000002}]
[null,null,null,2.6,3.399]
["StartGraph","F4",null,3.4,4.1989999999999998]
["TotalScoreLocation","F2",null,{"$f":"E11-0.8","v":4.2},5]
[]
["DebugCell","H2"]

{"sheet":"Instructions (2)","index":9,"n_rows":13,"n_cols":7,"rows_kept":13,"cut":false,"hidden":false,"merged":[]}
[]
[1,"On the Set Parameters sheet, configure:",null,null,null,null,"If want to change ranges or colors"]
[null,"a","Option: Change the range of colors for range of scores"]
[null,"b","Option: Change range of scores for range of colors"]
[null,"c","Set the number of slidebar graphs you want to generate"]
[null,"d","Click the Update Graphs buttion"]
[null,"e","Click OK when program done updating"]
[]
[2,"On the SidebarMetrics sheet, score",null,null,null,null,"If want to update graphs to reflect new scores"]
[null,"a","attach scores to each component"]
[null,"b","attach weights to each component"]
[null,"c","Click on Update Score button"]
[null,"d","Click OK when program done updating"]

{"sheet":"Debug","index":10,"n_rows":3,"n_cols":5,"rows_kept":3,"cut":false,"hidden":true,"merged":[]}
["Shape Name","TOP","Left","Width","Cell_Left"]
["buttonUpdateGraphs",3.75,535.5,81]
["SliderbarM",107.62496185302734,63,288]