{"text_format":"1","workbook":"xlsx","n_sheets":15,"sheets":["CoverSheet","Instructions for survey","Framework and wheel","Assessment Definitions","What is Digital Service","Digital Services Examples","Digital Services Framework","Survey","Scoring Detail","Scoring Summary","SlidebarMetrics","Set Parameters","Notes","MH Modifying Data","GBS SURVEY DATA FILE"],"not_rendered":{"charts":0,"images":15,"macros":1,"external_links":4,"defined_names":75,"comments":0,"pivot_tables":0},"unopened":[],"bounds":{"document_bytes":16777216,"sheet_cells":100000,"rows_first":2000,"rows_last":500,"rows_between":2000,"halvings":0,"cell_chars":16384,"cell_head_chars":4096},"cells_cut":0,"cells_raw":0,"read":"whole","date_system":"1900"}

{"sheet":"CoverSheet","index":0,"n_rows":0,"n_cols":0,"rows_kept":0,"cut":false,"hidden":false,"merged":[]}

{"sheet":"Instructions for survey","index":1,"n_rows":42,"n_cols":21,"rows_kept":42,"cut":false,"hidden":false,"merged":[[17,1,17,15],[16,1,16,15],[0,2,0,20],[2,1,2,15],[4,1,4,15],[6,1,6,14],[8,1,8,14],[10,1,10,14],[12,1,12,14],[14,1,14,14]]}
[null,null,"Digital Service Maturity Assessment Instructions"]
[]
[null,"The survey you are about to take will be used to measure your organization’s Digital Service readiness against a maturity model and scan potential opportunities to leverage Digital Service capabililties. The survey is organized around multiple dimensions – each includes a set of key attributes which define the practices and competencies in place within your organization today."]
[]
[null,"For each of these attributes, you will also be asked to define where you want your organization to be in the future.  Note that the most important characteristics are highlighted. The survey takes roughly 60 minutes to complete and our consultants are available to review the results with you.  All results are kept anonymous and used only for overall benchmarking purposes. On the Survey Tab for each question, please enter in the digit 1 to 5 that corresponds to your maturity level. "]
[]
[null,"Instructions"]
[]
{"$rows_left_out":35}
{"sheet":"Framework and wheel","index":2,"n_rows":0,"n_cols":0,"rows_kept":0,"cut":false,"hidden":true,"merged":[]}

{"sheet":"Assessment Definitions","index":3,"n_rows":12,"n_cols":3,"rows_kept":12,"cut":false,"hidden":false,"merged":[[0,2,0,5]]}
[null,null,"Digital Service Maturity Assessment Definitions"]
[]
[null,"Terms","Definitions"]
[null,"Digital Services","Digital Services is the operating model concept and desired outcome which shifts tasks that were traditionally delivered by human labor to automation \"aka digital labor\". \nTechnologies such as Robotics Process Automation (RPA) and Cognitive Computing support the implementation of digital labor in an organization."]
[null,"Robotic process automation (or RPA)"," An emerging[1] form of transactional  process automation technology based on the notion of software robots or artificial intelligence (AI) workers.  A software 'robot' is a software application that replicates the actions of a human being interacting with the user interface of a computer system. For example, the execution of data entry into an SAP system - or indeed a full end-to-end business process - would be a typical activity for a software robot"]
[null,"Cognitive computing (CC) ","Describes technology platforms that, broadly speaking, are based on the scientific disciplines of Artificial Intelligence and Signal Processing. These platforms encompass machine learning, reasoning, natural language processing, speech and vision, human-computer interaction, dialog and narrative generation and more.  IBM Watson is an example."]
[null,"Structured and Unstructured data"," Structured data is machine readable as represented in 1s and 0s and unstructured is non machine readable data such as images and pictures. "]
[null,"Machine learning (M2M)"," The subfield of computer science that \"gives computers the ability to learn without being explicitly programmed\". It evolved from the study of pattern recognition and computational learning theory in artificial intelligence machine learning explores the study and construction of algorithms that can learn from and make predictions on data and is an underpinning of digital services. "]
{"$rows_left_out":5}
{"sheet":"What is Digital Service","index":4,"n_rows":1,"n_cols":3,"rows_kept":1,"cut":false,"hidden":false,"merged":[[0,2,0,13]]}
[null,null,"Digital Service Maturity Assessment Definitions"]

{"sheet":"Digital Services Examples","index":5,"n_rows":1,"n_cols":1,"rows_kept":1,"cut":false,"hidden":false,"merged":[[0,0,0,21]]}
["Digital Service Maturity Assessment Examples"]

{"sheet":"Digital Services Framework","index":6,"n_rows":18,"n_cols":22,"rows_kept":18,"cut":false,"hidden":false,"merged":[[1,1,1,12],[1,13,1,19],[5,1,17,1],[0,0,0,21]]}
["Overview - Digital Service Readiness Framework"]
[]
[]
[null,null,null,null,null,null,null,null,null,null,null,null,null,"Stage1",null,"Stage 2",null,"Stage 3",null,"Stage 4",null,"Stage 5"]
[]
[null,null,null,null,null,null,null,null,null,"Description of Digital Services Readiness at the Different Levels ",null,"Strategy Alignment",null,"Static",null,"Incremental ",null,"Integrated",null,"Break-Through",null,"Transformational"]
[]
[null,null,null,null,null,null,null,null,null,null,null,"Organization Design",null,"No formal COE for digital services",null,"Digital services COE in planning stages",null,"Digital services COE pilot",null,"Established digital services COE in functions",null,"Established enterprise COE for digital services"]
{"$rows_left_out":11}
{"sheet":"Survey","index":7,"n_rows":86,"n_cols":20,"rows_kept":86,"cut":false,"hidden":false,"merged":[[0,1,0,22],[5,1,5,13],[58,1,58,13],[76,1,76,19],[17,1,17,13],[31,1,31,13],[40,1,40,13],[54,1,54,13]]}
[null,"Digital Services Maturity Assessment\n"]
[]
[]
[null,null,null,null,null,"Level 1 - Initial",null,"Level 2 - Repeatable",null,"Level 3 - Defined",null,"Level 4 - Controlled",null,"Level 5 - Optimized",null,"Current",null,"Future",null,"Comments"]
[1,"Strategy Alignment and Transformation"]
[null,"Outline of the defined strategic intent of automation and digital services, its purpose and relationship to the overall enterprise, including articulation of transformation initiatives underpinning automation vision and goals."]
[null,"What is the level of integration of the automation agenda in the overall State strategy?",null,"Integration of automation in overall business strategy",null,"There is little or no alignment between the use of automation and State missions, strategy and planning.",null,"There is ad-hoc alignment primarily in terms of identifying, funding and executing automation pilots tied to key State goals and initiatives.",null,"Automation is built into discrete operating plans with some consideration to agency and/or State goals and is included as a line item by business leaders for budgeting purposes.",null,"Automation is built into discrete operating plans and selectively aligned to other agency and/or State goals and is included as a line item by business leaders for budgeting purposes, including an emphasis on coordination of similar efforts.",null,"Bi-directional formulation of strategy and planning between functional, agency and State management on the use and deployment of automation technology and services. Automation is fully understood on how it fits State cost and performance goals.",null,1,null,2]
[]
{"$rows_left_out":79}
{"sheet":"Scoring Detail","index":8,"n_rows":38,"n_cols":11,"rows_kept":38,"cut":false,"hidden":false,"merged":[[0,4,0,17],[2,1,3,1],[2,2,3,2],[2,7,2,10]]}
[]
[]
[null,"Capability","Maturity Question",null,"Assessed","Target",null,"Dimension"]
[null,null,null,null,null,null,null,"People","Process","Technology","Data"]
[1,{"$f":"Survey!B5","v":"Strategy Alignment and Transformation"},1,{"$f":"INDEX(Survey!$B$5:$B$197,MATCH(B$5,Survey!$B$5:$B$197,0)+2*C5,0)","v":"What is the level of integration of the automation agenda in the overall State strategy?"},{"$f":"INDEX(Survey!$B$5:$R$200,MATCH(B$5,Survey!$B$5:$B$200,0)+2*C5,15)","v":1},{"$f":"INDEX(Survey!$B$5:$R$200,MATCH(B$5,Survey!$B$5:$B$200,0)+2*C5,17)","v":2},null,{"$f":"MATCH(B5,Survey!$B$5:$B$200,0)+2*C5","v":3}]
[null,null,{"$f":"C5+1","v":2},{"$f":"INDEX(Survey!$B$5:$B$197,MATCH(B$5,Survey!$B$5:$B$197,0)+2*C6,0)","v":"How would you characterize automation investment strategies including Opex vs. Capex preference ?"},{"$f":"INDEX(Survey!$B$5:$R$200,MATCH(B$5,Survey!$B$5:$B$200,0)+2*C6,15)","v":1},{"$f":"INDEX(Survey!$B$5:$R$200,MATCH(B$5,Survey!$B$5:$B$200,0)+2*C6,17)","v":2}]
[null,null,{"$f":"C6+1","v":3},{"$f":"INDEX(Survey!$B$5:$B$197,MATCH(B$5,Survey!$B$5:$B$197,0)+2*C7,0)","v":"How would you characterize the business outcomes that you wish to achieve from automation services and projects ?  Is the benefit acting like a human or thinking like a human. "},{"$f":"INDEX(Survey!$B$5:$R$200,MATCH(B$5,Survey!$B$5:$B$200,0)+2*C7,15)","v":1},{"$f":"INDEX(Survey!$B$5:$R$200,MATCH(B$5,Survey!$B$5:$B$200,0)+2*C7,17)","v":2}]
[null,null,4,{"$f":"INDEX(Survey!$B$5:$B$197,MATCH(B$5,Survey!$B$5:$B$197,0)+2*C8,0)","v":" Is automation part of the  transformation agenda?"},{"$f":"INDEX(Survey!$B$5:$R$200,MATCH(B$5,Survey!$B$5:$B$200,0)+2*C8,15)","v":1},{"$f":"INDEX(Survey!$B$5:$R$200,MATCH(B$5,Survey!$B$5:$B$200,0)+2*C8,17)","v":2}]
{"$rows_left_out":31}
{"sheet":"Scoring Summary","index":9,"n_rows":10,"n_cols":9,"rows_kept":10,"cut":false,"hidden":false,"merged":[[0,1,0,4]]}
[null,"Digital Service Assessment Survey Scorecard"]
[]
[null,"Capability Category","Assess","Target"]
[1,{"$f":"I4","v":"Strategy Alignment and Transformation"},{"$f":"getScoreAssess(A4)","v":1},{"$f":"getTargetAssess(A4)","v":2},null,null,null,null,{"$f":"VLOOKUP(A4,'Scoring Detail'!$A$1:$B$47,2,FALSE)","v":"Strategy Alignment and Transformation"}]
[2,{"$f":"I5","v":"Process Excellence and Delivery"},{"$f":"getScoreAssess(A5)","v":2},{"$f":"getTargetAssess(A5)","v":3},null,null,null,null,{"$f":"VLOOKUP(A5,'Scoring Detail'!$A$1:$B$47,2,FALSE)","v":"Process Excellence and Delivery"}]
[3,"Delivery and partner strategy and commercial orientation",3,4,null,null,null,null,{"$f":"VLOOKUP(A6,'Scoring Detail'!$A$1:$B$47,2,FALSE)","v":"Delivery and partner strategy and commercial orientation"}]
[4,"Enabling Technology ",4,5,null,null,null,null,{"$f":"VLOOKUP(A7,'Scoring Detail'!$A$1:$B$47,2,FALSE)","v":"Enabling Technology "}]
[5,"Data and Analytics",{"$f":"getScoreAssess(A8)","v":5},{"$f":"getTargetAssess(A8)","v":5},null,null,null,null,{"$f":"VLOOKUP(A8,'Scoring Detail'!$A$1:$B$47,2,FALSE)","v":"Data and Analytics"}]
{"$rows_left_out":3}
{"sheet":"SlidebarMetrics","index":10,"n_rows":10,"n_cols":6,"rows_kept":10,"cut":false,"hidden":false,"merged":[]}
[null,null,null,null,null,"Average Overall  Score"]
[null,{"$f":"ROUND(SUMPRODUCT(B4:B7,D4:D7)/SUM(D3:D7),1)","v":2.5},{"$f":"ROUND(SUMPRODUCT(C4:C7,D4:D7)/SUM(D3:D7),1)","v":3.5}]
["graphNum","rawAssScore","rawTrgScore","weight","Capability Category","Category Score"]
[1,{"$f":"'Scoring Summary'!C4","v":1},{"$f":"'Scoring Summary'!D4","v":2},1,{"$f":"'Scoring Summary'!B4","v":"Strategy Alignment and Transformation"}]
[{"$f":"A4+1","v":2},{"$f":"'Scoring Summary'!C5","v":2},{"$f":"'Scoring Summary'!D5","v":3},1,{"$f":"'Scoring Summary'!B5","v":"Process Excellence and Delivery"}]
[{"$f":"A5+1","v":3},{"$f":"'Scoring Summary'!C6","v":3},{"$f":"'Scoring Summary'!D6","v":4},1,{"$f":"'Scoring Summary'!B6","v":"Delivery and partner strategy and commercial orientation"}]
[4,{"$f":"'Scoring Summary'!C7","v":4},{"$f":"'Scoring Summary'!D7","v":5},1,{"$f":"'Scoring Summary'!B7","v":"Enabling Technology "}]
[5,{"$f":"'Scoring Summary'!C8","v":5},{"$f":"'Scoring Summary'!D8","v":5},1,{"$f":"'Scoring Summary'!B8","v":"Data and Analytics"}]
{"$rows_left_out":3}
{"sheet":"Set Parameters","index":11,"n_rows":13,"n_cols":5,"rows_kept":13,"cut":false,"hidden":false,"merged":[]}
["Set Parameters"]
[]
["SourceGraph"]
[]
[]
[null,null,null,"Low","High"]
["TargetSheet","SlidebarMetrics",null,{"$f":"ROUND(E7-0.8,1)","v":1},{"$f":"D8-0.001","v":1.7990000000000002}]
["NumberSlideGraphs",7,null,{"$f":"ROUND(E8-0.8,1)","v":1.8},{"$f":"D9-0.001","v":2.5990000000000002}]
{"$rows_left_out":6}
{"sheet":"Notes","index":12,"n_rows":38,"n_cols":22,"rows_kept":38,"cut":false,"hidden":true,"merged":[]}
[]
["Regardless of the size, complexity, or length of your automation initiative, there is a common set of drivers, or perhaps best practices, that will impact overall success and financial returns.  Some of the key drivers include:"]
["·        Planning and Strategy - Better quality of planning and a well-defined automation strategy lead to increased savings.  Organizations that approach process automation with discipline and forethought achieve greater savings than organizations that do not.  This includes having a sourcing strategy on where to own (purchase), rent (SaaS/PaaS) or outsource the automation capabilities.  It also includes the upfront planning to maximize the savings from each automation initiative and prioritization of the automation portfolio based on overall return to the entity.  Finally, it includes selecting the right category of automation for a specific domain or process."]
["·        Automation Governance - Better quality of automation governance leads to increased savings.  Digital labor automation is not a panacea that once implemented solves all problems going forward.  DLA, like any key business initiative, should be viewed and managed as a dynamic capability that needs to be governed in a way that can dynamically respond to ever changing business needs.  This governance includes a robust change management program addressing both business change (e.g. changes / additions to the process suite), as well as technology change (e.g. continued assessment of new capabilities and tools supporting process automation), and the continued effort of prioritization of the resulting changes based on benefit to the business.  Furthermore, automation governance should include a focus on continuous improvement of automation results through a defined approach to oversight – e.g. is the automation addressing the business to the full extent possible; is ‘business as usual’ setting the bar too low; are we capturing the associated ‘learnings’ into the automation on a regular basis.  Finally, proper governance translates to  having the right amount of retained staff ‘post automation’.  Retained staffing levels should be the result of thoughtful consideration for workloads resulting from the execution of non-automated process activities, oversight of automation maintenance and change management, and support for the automation continuous improvement process.  Furthermore, organizations need to ensure that shadow organizations do not continue to exist that perform the same work that has been automated."]
["·        Executive Support - Higher levels of executive support and having an appropriate ‘culture’ lead to increased savings.  Executive vision, leadership and communication are essential to create the appropriate culture to support successful process automation.   The resulting culture includes a corporate-wide vision to enhance automation rather than piecemeal initiatives.  This kind of corporate-wide strategy to automation allows for a unified approach to tool selection, best practices, governance, etc., and avoids a siloed approach by each business unit.  A ‘cultural’ approach to automation includes actively rewarding individuals who show innovative support for automation and discourages an attitude that is combative to change.  Corporate-wide strategies include defined plans to acknowledge that while some positions may be eliminated, the elimination of the mundane repetitive task by retained personnel, will allow them to focus on strategic initiatives to make the business more successful – thereby empowering their employees to ‘make a difference’ and experience more job satisfaction."]
["·        Risk and Security Constraints – Risk and security constraints often reduce savings and increase the time to recover investments - this is particularly true when the risks and security concerns are identified after the fact.  No one will argue the importance of diligent risk management and proper security protocols.  However, it is vital to understand all of the risk and security constraints upfront and have a mitigation plan that all stakeholders have agreed to in advance to rolling out the process automation(s).  Not having this agreement upfront can seriously undermine efforts that have already been started, result in a patchwork type implementation, concerns about the level of ‘safety’, and reduce or entirely remove the savings potential - in some cases even bringing an end to the automation initiative itself.  This is especially important in highly risk adverse organizations / industries.  "]
["·        Enterprise Automation Integration - Integration with other automation efforts leads to increased savings.   Just like business process optimization would suggest that the best process is a truly centralized end-to-end process with an identified process owner, automation also benefits from integration across the enterprise.  While process automation (particularly within category 1) can indeed be implemented by automating ‘select’ activities within a process, larger savings are realized when automations are extended deeper into the process and even allowed to extend across business unit boundaries (i.e. the ‘hire to retire’ single process viewpoint).  Organizations should look for opportunities to leverage existing and planned automation efforts with other shared systems and processes.  This integration can include internal as well as external partners."]
["·        Influence or Mandate - The ability to influence, or possibly mandate, the adoption of automation decreases the payback time and leads to increased savings.  In many cases, end-user focused automation will happen slowly over time.  Consider for example the ‘consumer focused’ automations such as bank ATMs, self check-out at retail stores, and web sites used for insurance quotes or booking travel - all of these have typically resulted in gradual increases in adoption and associated savings as clients gain awareness of alternative transaction options, develop trust and familiarity with the process and finally adapt the new technology as the preferred approach.  Conversely, automation in the business world can enjoy quicker adoption timeframes as executive sponsorship (discussed above), effective communication strategies and organizational change management, and training are combined to drive quicker acceptance and lead to faster return on investment through optimum levels of automation."]
{"$rows_left_out":31}
{"sheet":"MH Modifying Data","index":13,"n_rows":24,"n_cols":53,"rows_kept":24,"cut":false,"hidden":true,"merged":[]}
[null,null,null,null,null,null,null,null,null,null,"<Pull Down Here>",null,null,null,"Not Applicable",null,"Not Applicable",null,null,null,null,null,null,null,"Not Applicable",null,null,null,null,null,null,null,null,null,null,null,null,null,"<Pull Down Here>",null,"<Pull Down Here>","<Pull Down Here>",null,"<Pull Down Here>"]
["Less than 1000",null,"<Pull Down Here>",null,"Decentralized Process",null,"CFO",null,"<Pull Down Here>",null,0,null,"Not Applicable",null,"1-2",null,"<Pull Down Here>",null,"Not Applicable",null,"Not Applicable","Not Applicable","Not Applicable",null,"<Pull Down Here>",null,"<Pull Down Here>",null,"<Pull Down Here>",null,"<Pull Down Here>","<Pull Down Here>","Departmental",null,"<Pull Down Here>","<Pull Down Here>","<Pull Down Here>",null,0,null,"No involvement ","Executive leaders have, at times, played the role of detractors to automation",null,"IT budget virtually entirely consumed with \"keeping the lights on.\" ",null,null,null,null,null,null,null,null,"< Pull Down Here >"]
["1000 to 5000",null,"NA or '0'",null,"Centralized Process",null,"CIO",null,"Cost Savings",null,0.1,null,"Before 1995",null,"3-5",null,"Aerospace & Defence",null,"<Pull Down Here>",null,"<Pull Down Here>","<Pull Down Here>","<Pull Down Here>",null,10000,null,"Upto 1000",null,"Before 1995",null,"1","10 : 90","Functional",null,"Not Started","GBS ","None",null,"1-10",null,"Visibility but no involvement","Executives are neither supporters nor detractors. ",null,"5% or less of related IT budget is dedicated to innovation. ",null,null,null,null,null,null,null,null,"No current plans"]
["5001 to 10,000",null,"Less than 100",null,"Business Services",null,"Other C-level",null,"Headcount Reduction",null,0.2,null,1996,null,"6-9",null,"Automotives",null,0,null,"Yes","High","CEO",null,20000,null,"1000 - 2000",null,1996,null,"2","20 : 80","Enterprise",null,"2012","Corporate /  Leadership","Basic RPA",null,"11-50",null,"\nInvolvement in supporting/operational role\n","Executive team buy-in with inconsistent support across the organization. ",null,"Between 5% and 10% of related IT budget is dedicated to innovation. ",null,null,null,null,null,null,null,null,"Pilot"]
["10,001 to 20,000",null,"100 to 500",null,"Global Business Services (GBS)",null,"Sr. VP",null,"Process Efficiency",null,0.3,null,1997,null,"10 or more",null,"Alternative Investments",null,1,null,"No","Medium","CFO",null,30000,null,"2000 - 3000",null,1997,null,"3","30: 70",null,null,"2013","Internal Strategy","Enhanced RPA",null,"51-100",null,"Involvement in leadership role","Executive team buy-in and active participation",null,"Between 10% and 20% of IT budget is dedicated to innovation. ",null,null,null,null,null,null,null,null,"Live Implementation"]
["20,001 to 50,000",null,"501 to 1000",null,"Multifunctional GBS",null,"VP",null,null,null,0.4,null,1998,null,null,null,"Banking & Capital Markets",null,2,null,null,"Low","CIO",null,40000,null,"3000 - 5000",null,1998,null,"4","40 : 60",null,null,"2014","Functional Services","Cognitive",null,"101-250",null,null,"Executive team buys-in and plays an active role in implementing and sustaining Automation",null,"20% or more of related IT budget is dedicated to innovation. "]
["50,001 to 100,000",null,"1001 to 2000",null,null,null,"Director",null,null,null,0.5,null,1999,null,null,null,"Building, Construction & Real Estate",null,3,null,null,null,"Sr. VP",null,70000,null,"8000 - 10,000",null,2000,null,"5","50 : 50",null,null,"2015","Other","All of the Above",null,"250 - 500"]
["100,001 to 250,000",null,"2001 to 5000",null,null,null,"Manager",null,null,null,0.6,null,2000,null,null,null,"Diversified Industries",null,4,null,null,null,"VP",null,80000,null,"More than 10,000",null,2001,null,null,"60 : 40",null,null,"2016",null,null,null,"501 +"]
{"$rows_left_out":17}
{"sheet":"GBS SURVEY DATA FILE","index":14,"n_rows":76,"n_cols":5,"rows_kept":76,"cut":false,"hidden":true,"merged":[]}
[]
[]
[]
[null,"OVERALL",{"$f":"AVERAGE(C6,C13,C23,C28,C33,C40,C45,C54,C64,C70)","v":{"$error":"#REF!"}},{"$f":"AVERAGE(D6,D13,D23,D28,D33,D40,D45,D54,D64,D70)","v":{"$error":"#REF!"}}]
[null,"GBS Category","Current Average","Aspirational Average","COMMENTS"]
[null,"Strategy",{"$f":"AVERAGE(C7:C12)","v":{"$error":"#REF!"}},{"$f":"AVERAGE(D7:D12)","v":{"$error":"#REF!"}}]
[1,"Integration of GBS in overall Business Strategy",{"$f":"#REF!","v":{"$error":"#REF!"}},{"$f":"#REF!","v":{"$error":"#REF!"}},{"$f":"#REF!","v":{"$error":"#REF!"}}]
[2,"Investment Strategy",{"$f":"#REF!","v":{"$error":"#REF!"}},{"$f":"#REF!","v":{"$error":"#REF!"}},{"$f":"#REF!","v":{"$error":"#REF!"}}]
{"$rows_left_out":68}